Debian install error.

Debian install error.

Postby coreyman » 05 Oct 2012, 22:55

cd src/ && make -f Makefile install
make[1]: Entering directory `/home/coreyman/Downloads/keepassx-0.4.3/src'
g++ -c -include ../build/keepassx -m64 -pipe -O2 -Wall -W -D_REENTRANT -DAUTOTYPE -DGLOBAL_AUTOTYPE -DQT_NO_DEBUG -DQT_XML_LIB -DQT_GUI_LIB -DQT_CORE_LIB -I/usr/share/qt4/mkspecs/linux-g++-64 -I. -I/usr/include/qt4/QtCore -I/usr/include/qt4/QtGui -I/usr/include/qt4/QtXml -I/usr/include/qt4 -I. -Ilib -Icrypto -Iplugins/interfaces -Iexport -Iimport -Idialogs -I../build/ui -I../build/moc -o ../build/random.o lib/random.cpp
lib/random.cpp: In function ‘void initStdRand()’:
lib/random.cpp:98:19: error: ‘getpid’ was not declared in this scope
make[1]: *** [../build/random.o] Error 1
make[1]: Leaving directory `/home/coreyman/Downloads/keepassx-0.4.3/src'
make: *** [sub-src-install_subtargets] Error 2

**** Installation failed. Aborting package creation.

Cleaning up...OK

Bye.







What do I need to do?
coreyman
KPX user
 
Posts: 5
Joined: 05 Oct 2012, 22:54
Full Name: Corey manshack

Re: Debian install error.

Postby coreyman » 20 Nov 2012, 00:53

Still no reply on this in months, and I would like to use this...
coreyman
KPX user
 
Posts: 5
Joined: 05 Oct 2012, 22:54
Full Name: Corey manshack

Re: Debian install error.

Postby coreyman » 18 Dec 2012, 17:58

Just a follow up, turns out they had a package for this in the repository so I just installed that and it works fine
coreyman
KPX user
 
Posts: 5
Joined: 05 Oct 2012, 22:54
Full Name: Corey manshack

Re: Debian install error.

Postby manatax » 28 Jul 2014, 21:24

Can you please elaborate?
I have a similar problem.
manatax
KPX user
 
Posts: 1
Joined: 28 Jul 2014, 21:15
Full Name: Zeke


Return to KeePassX under Linux

Who is online

Users browsing this forum: No registered users and 2 guests

cron